Target
Nuclear receptor coactivator 3
Ligand
BDBM87317
Substrate
Meas. Tech.
Counterscreen for inhibitors of the Steroid Receptor Coactivator 1 (SRC1; NCOA1)
IC50
2116±n/a nM
Citation
 PubChem, PC Counterscreen for inhibitors of the Steroid Receptor Coactivator 1 (SRC1; NCOA1): Luminescence-based cell-based high throughput dose response assay to identify inhibitors of the Steroid Receptor Coactivator 3 (SRC3; NCOA3) PubChem Bioassay (2012)[AID] 
Target
Name:
Nuclear receptor coactivator 3
Synonyms:
AIB1 NCOA3 RAC3 nuclear receptor coactivator 3 isoform a
Type:
Enzyme Catalytic Domain
Mol. Mass.:
155305.29
Organism:
Homo sapiens (Human)
Description:
Q9Y6Q9
Residue:
1424
  
Inhibitor
Name:
BDBM87317
Synonyms:
3-[(5Z)-5-(4-ethoxybenzylidene)-4-keto-2-thioxo-thiazolidin-3-yl]propionic acid 3-[(5Z)-5-[(4-ethoxyphenyl)methylidene]-4-oxo-2-sulfanylidene-1,3-thiazolidin-3-yl]propanoic acid 3-{5-[1-(4-Ethoxy-phenyl)-meth-(Z)-ylidene]-4-oxo-2-thioxo-thiazolidin-3-yl}-propionic acid SMR000413650 | cid_1922279
Type:
Small organic molecule
Emp. Form.:
C15H15NO4S2
Mol. Mass.:
337.414
SMILES:
CCOc1ccc(\C=C2/SC(=S)N(CCC(O)=O)C2=O)cc1
: