Target
Nuclear receptor coactivator 3
Ligand
BDBM87588
Substrate
Meas. Tech.
Counterscreen for inhibitors of the Steroid Receptor Coactivator 1 (SRC1; NCOA1)
IC50
9666±n/a nM
Citation
 PubChem, PC Counterscreen for inhibitors of the Steroid Receptor Coactivator 1 (SRC1; NCOA1): Luminescence-based cell-based high throughput dose response assay to identify inhibitors of the Steroid Receptor Coactivator 3 (SRC3; NCOA3) PubChem Bioassay (2012)[AID] 
Target
Name:
Nuclear receptor coactivator 3
Synonyms:
AIB1 NCOA3 RAC3 nuclear receptor coactivator 3 isoform a
Type:
Enzyme Catalytic Domain
Mol. Mass.:
155305.29
Organism:
Homo sapiens (Human)
Description:
Q9Y6Q9
Residue:
1424
  
Inhibitor
Name:
BDBM87588
Synonyms:
MLS001211695 N'-[(E)-(5-ethoxy-6-oxidanylidene-cyclohexa-2,4-dien-1-ylidene)methyl]pyridine-3-carbohydrazide N'-[(E)-(5-ethoxy-6-oxocyclohexa-2,4-dien-1-ylidene)methyl]pyridine-3-carbohydrazide SMR000513244 | cid_5401892
Type:
Small organic molecule
Emp. Form.:
C15H15N3O3
Mol. Mass.:
285.2979
SMILES:
CCOc1cccc(C=NNC(=O)c2cccnc2)c1O
: