Target
Nuclear receptor coactivator 1
Ligand
BDBM36905
Substrate
Meas. Tech.
Luminescence-based cell-based high throughput dose response assay for inhibitors of the Steroid Receptor Coactivator 1 (SRC1; NCOA1)
IC50
12857±n/a nM
Citation
 PubChem, PC Luminescence-based cell-based high throughput dose response assay for inhibitors of the Steroid Receptor Coactivator 1 (SRC1; NCOA1) PubChem Bioassay (2012)[AID] 
Target
Name:
Nuclear receptor coactivator 1
Synonyms:
BHLHE74 NCOA1 NCoA-1 Protein Hin-2 Renal carcinoma antigen NY-REN-52 SRC1 nuclear receptor coactivator 1 isoform 1
Type:
PROTEIN
Mol. Mass.:
156749.34
Organism:
Homo sapiens (Human)
Description:
ChEMBL_759690
Residue:
1441
  
Inhibitor
Name:
BDBM36905
Synonyms:
4-amino-6-methyl-2-(trifluoromethyl)-3-quinolinecarbonitrile 4-azanyl-6-methyl-2-(trifluoromethyl)quinoline-3-carbonitrile SMR000036800 | cid_660762
Type:
Small organic molecule
Emp. Form.:
C12H8F3N3
Mol. Mass.:
251.2072
SMILES:
Cc1ccc2nc(c(C#N)c(N)c2c1)C(F)(F)F
: