Target
Nuclear receptor coactivator 1
Ligand
BDBM53766
Substrate
Meas. Tech.
Luminescence-based cell-based high throughput dose response assay for inhibitors of the Steroid Receptor Coactivator 1 (SRC1; NCOA1)
IC50
8359±n/a nM
Citation
 PubChem, PC Luminescence-based cell-based high throughput dose response assay for inhibitors of the Steroid Receptor Coactivator 1 (SRC1; NCOA1) PubChem Bioassay (2012)[AID] 
Target
Name:
Nuclear receptor coactivator 1
Synonyms:
BHLHE74 NCOA1 NCoA-1 Protein Hin-2 Renal carcinoma antigen NY-REN-52 SRC1 nuclear receptor coactivator 1 isoform 1
Type:
PROTEIN
Mol. Mass.:
156749.34
Organism:
Homo sapiens (Human)
Description:
ChEMBL_759690
Residue:
1441
  
Inhibitor
Name:
BDBM53766
Synonyms:
MLS000541224 N'-[(E)-(3-bromanyl-5-methoxy-6-oxidanylidene-cyclohexa-2,4-dien-1-ylidene)methyl]-2-(3-methoxy-4-nitro-pyrazol-1-yl)propanehydrazide N'-[(E)-(3-bromo-5-methoxy-6-oxocyclohexa-2,4-dien-1-ylidene)methyl]-2-(3-methoxy-4-nitropyrazol-1-yl)propanehydrazide SMR000162245 | cid_6033337
Type:
Small organic molecule
Emp. Form.:
C15H16BrN5O6
Mol. Mass.:
442.221
SMILES:
COc1nn(cc1[N+]([O-])=O)C(C)C(=O)N\[NH+]=C\c1cc(Br)cc(OC)c1[O-]
: