Target
Nuclear receptor coactivator 1
Ligand
BDBM67919
Substrate
Meas. Tech.
Luminescence-based cell-based high throughput dose response assay for inhibitors of the Steroid Receptor Coactivator 1 (SRC1; NCOA1)
IC50
4256±n/a nM
Citation
 PubChem, PC Luminescence-based cell-based high throughput dose response assay for inhibitors of the Steroid Receptor Coactivator 1 (SRC1; NCOA1) PubChem Bioassay (2012)[AID] 
Target
Name:
Nuclear receptor coactivator 1
Synonyms:
BHLHE74 NCOA1 NCoA-1 Protein Hin-2 Renal carcinoma antigen NY-REN-52 SRC1 nuclear receptor coactivator 1 isoform 1
Type:
PROTEIN
Mol. Mass.:
156749.34
Organism:
Homo sapiens (Human)
Description:
ChEMBL_759690
Residue:
1441
  
Inhibitor
Name:
BDBM67919
Synonyms:
1-[4-(2,4-Dichloro-benzyloxy)-phenyl]-3-phenyl-thiourea 1-[4-[(2,4-dichlorophenyl)methoxy]phenyl]-3-phenyl-thiourea MLS000555361 cid_1143231
Type:
Small organic molecule
Emp. Form.:
C20H16Cl2N2OS
Mol. Mass.:
403.325
SMILES:
Clc1ccc(COc2ccc(NC(=S)Nc3ccccc3)cc2)c(Cl)c1
: