Target
Nuclear receptor coactivator 1
Ligand
BDBM44131
Substrate
Meas. Tech.
Luminescence-based cell-based high throughput dose response assay for inhibitors of the Steroid Receptor Coactivator 1 (SRC1; NCOA1)
IC50
9376±n/a nM
Citation
 PubChem, PC Luminescence-based cell-based high throughput dose response assay for inhibitors of the Steroid Receptor Coactivator 1 (SRC1; NCOA1) PubChem Bioassay (2012)[AID] 
Target
Name:
Nuclear receptor coactivator 1
Synonyms:
BHLHE74 NCOA1 NCoA-1 Protein Hin-2 Renal carcinoma antigen NY-REN-52 SRC1 nuclear receptor coactivator 1 isoform 1
Type:
PROTEIN
Mol. Mass.:
156749.34
Organism:
Homo sapiens (Human)
Description:
ChEMBL_759690
Residue:
1441
  
Inhibitor
Name:
BDBM44131
Synonyms:
3-(4-chlorophenyl)-2,5-dimethyl-6-(phenylmethyl)-1H-pyrazolo[1,5-a]pyrimidin-7-one 6-benzyl-3-(4-chlorophenyl)-2,5-dimethylpyrazolo[1,5-a]pyrimidin-7(4H)-one SMR000313178 | cid_7326949
Type:
Small organic molecule
Emp. Form.:
C21H18ClN3O
Mol. Mass.:
363.84
SMILES:
Cc1[nH]n2c(nc(C)c(Cc3ccccc3)c2=O)c1-c1ccc(Cl)cc1
: