Target
Nuclear receptor coactivator 1
Ligand
BDBM34924
Substrate
Meas. Tech.
Luminescence-based cell-based high throughput dose response assay for inhibitors of the Steroid Receptor Coactivator 1 (SRC1; NCOA1)
IC50
22721±n/a nM
Citation
 PubChem, PC Luminescence-based cell-based high throughput dose response assay for inhibitors of the Steroid Receptor Coactivator 1 (SRC1; NCOA1) PubChem Bioassay (2012)[AID] 
Target
Name:
Nuclear receptor coactivator 1
Synonyms:
BHLHE74 NCOA1 NCoA-1 Protein Hin-2 Renal carcinoma antigen NY-REN-52 SRC1 nuclear receptor coactivator 1 isoform 1
Type:
PROTEIN
Mol. Mass.:
156749.34
Organism:
Homo sapiens (Human)
Description:
ChEMBL_759690
Residue:
1441
  
Inhibitor
Name:
BDBM34924
Synonyms:
3-methoxy-10-pyrido[1,2-a]indolecarbonitrile 3-methoxypyrido[1,2-a]indole-10-carbonitrile SMR000335120 | cid_1488983
Type:
Small organic molecule
Emp. Form.:
C14H10N2O
Mol. Mass.:
222.242
SMILES:
COc1ccc2c(C#N)c3ccccn3c2c1
: