Target
V-type proton ATPase subunit c'
Ligand
BDBM50223675
Substrate
Meas. Tech.
Dose Response of Small Molecules that Regulate V-ATPase Proton Transport in Yeast using pHLuorin, Powder Set1
EC50
4181±n/a nM
Citation
 PubChem, PC Dose Response of Small Molecules that Regulate V-ATPase Proton Transport in Yeast using pHLuorin, Powder Set1 PubChem Bioassay (2012)[AID] 
Target
Name:
V-type proton ATPase subunit c'
Synonyms:
CLS9 VATL2_YEAST Vma11p
Type:
Enzyme Catalytic Domain
Mol. Mass.:
17039.28
Organism:
Saccharomyces cerevisiae S288c
Description:
gi_6325022
Residue:
164
  
Inhibitor
Name:
BDBM50223675
Synonyms:
CHEMBL251369 cid_2996093
Type:
Small organic molecule
Emp. Form.:
C15H15N3O5
Mol. Mass.:
317.2967
SMILES:
[O-][N+](=O)c1ccc(o1)C(=O)Nc1ccccc1N1CCOCC1
: