Target
Polyadenylate-binding protein 1
Ligand
BDBM87613
Substrate
Meas. Tech.
Dose-response confirmation of microRNA-mediated mRNA deadenylation inhibitors by fluoresence polarization assay
IC50
>66000±n/a nM
Citation
 PubChem, PC Dose-response confirmation of microRNA-mediated mRNA deadenylation inhibitors by fluoresence polarization assay PubChem Bioassay (2012)[AID] 
Target
Name:
Polyadenylate-binding protein 1
Synonyms:
PAB1 PABP1 PABPC1 poly(A) binding protein, cytoplasmic 1 | polyadenylate-binding protein 1
Type:
Enzyme Catalytic Domain
Mol. Mass.:
70694.26
Organism:
Homo sapiens (Human)
Description:
gi_46367787
Residue:
636
  
Inhibitor
Name:
BDBM87613
Synonyms:
2-[[5-(3-carbamothioylphenyl)-1,3,4-oxadiazol-2-yl]sulfanyl]ethyl carbamate MLS000032703 carbamic acid 2-[[5-(3-carbamothioylphenyl)-1,3,4-oxadiazol-2-yl]thio]ethyl ester cid_3716125
Type:
Small organic molecule
Emp. Form.:
C12H12N4O3S2
Mol. Mass.:
324.379
SMILES:
NC(=O)OCCSc1nnc(o1)-c1cccc(c1)C(N)=S
: