Target
Polyadenylate-binding protein 1
Ligand
BDBM87618
Substrate
Meas. Tech.
Dose-response confirmation of microRNA-mediated mRNA deadenylation inhibitors by fluoresence polarization assay
IC50
>66000±n/a nM
Citation
 PubChem, PC Dose-response confirmation of microRNA-mediated mRNA deadenylation inhibitors by fluoresence polarization assay PubChem Bioassay (2012)[AID] 
Target
Name:
Polyadenylate-binding protein 1
Synonyms:
PAB1 PABP1 PABPC1 poly(A) binding protein, cytoplasmic 1 | polyadenylate-binding protein 1
Type:
Enzyme Catalytic Domain
Mol. Mass.:
70694.26
Organism:
Homo sapiens (Human)
Description:
gi_46367787
Residue:
636
  
Inhibitor
Name:
BDBM87618
Synonyms:
2-[[7-[(Z)-3-chlorobut-2-enyl]-2,6-diketo-3-methyl-purin-8-yl]thio]acetic acid ethyl ester MLS000037555 cid_1232727 ethyl 2-[7-[(Z)-3-chlorobut-2-enyl]-3-methyl-2,6-dioxopurin-8-yl]sulfanylacetate
Type:
Small organic molecule
Emp. Form.:
C14H17ClN4O4S
Mol. Mass.:
372.827
SMILES:
CCOC(=O)CSc1nc2n(C)c(=O)[nH]c(=O)c2n1C\C=C(\C)Cl
: