Target
Polyadenylate-binding protein 1
Ligand
BDBM87621
Substrate
Meas. Tech.
Dose-response confirmation of microRNA-mediated mRNA deadenylation inhibitors by fluoresence polarization assay
IC50
25970±n/a nM
Citation
 PubChem, PC Dose-response confirmation of microRNA-mediated mRNA deadenylation inhibitors by fluoresence polarization assay PubChem Bioassay (2012)[AID] 
Target
Name:
Polyadenylate-binding protein 1
Synonyms:
PAB1 PABP1 PABPC1 poly(A) binding protein, cytoplasmic 1 | polyadenylate-binding protein 1
Type:
Enzyme Catalytic Domain
Mol. Mass.:
70694.26
Organism:
Homo sapiens (Human)
Description:
gi_46367787
Residue:
636
  
Inhibitor
Name:
BDBM87621
Synonyms:
8-(2-furanyl)-3,3-dimethyl-6-oxo-4,7-dihydro-1H-thiopyrano[3,4-c]pyridine-5-carbonitrile 8-(furan-2-yl)-3,3-dimethyl-6-oxidanylidene-4,7-dihydro-1H-thiopyrano[3,4-c]pyridine-5-carbonitrile MLS000071238 cid_658451
Type:
Small organic molecule
Emp. Form.:
C15H14N2O2S
Mol. Mass.:
286.349
SMILES:
CC1(C)Cc2c(CS1)c([nH]c(=O)c2C#N)-c1ccco1
: