Target
Polyadenylate-binding protein 1
Ligand
BDBM87635
Substrate
Meas. Tech.
Dose-response confirmation of microRNA-mediated mRNA deadenylation inhibitors by fluoresence polarization assay
IC50
>66000±n/a nM
Citation
 PubChem, PC Dose-response confirmation of microRNA-mediated mRNA deadenylation inhibitors by fluoresence polarization assay PubChem Bioassay (2012)[AID] 
Target
Name:
Polyadenylate-binding protein 1
Synonyms:
PAB1 PABP1 PABPC1 poly(A) binding protein, cytoplasmic 1 | polyadenylate-binding protein 1
Type:
Enzyme Catalytic Domain
Mol. Mass.:
70694.26
Organism:
Homo sapiens (Human)
Description:
gi_46367787
Residue:
636
  
Inhibitor
Name:
BDBM87635
Synonyms:
4-isopropyl-3,5,6,7,8,8a-hexahydro-1H-quinazolin-2-one MLS000054810 cid_2866904
Type:
Small organic molecule
Emp. Form.:
C11H18N2O
Mol. Mass.:
194.2734
SMILES:
CC(C)C1=NC(=O)NC2CCCCC12
: