Target
Polyadenylate-binding protein 1
Ligand
BDBM87652
Substrate
Meas. Tech.
Dose-response confirmation of microRNA-mediated mRNA deadenylation inhibitors by fluoresence polarization assay
IC50
>66000±n/a nM
Citation
 PubChem, PC Dose-response confirmation of microRNA-mediated mRNA deadenylation inhibitors by fluoresence polarization assay PubChem Bioassay (2012)[AID] 
Target
Name:
Polyadenylate-binding protein 1
Synonyms:
PAB1 PABP1 PABPC1 poly(A) binding protein, cytoplasmic 1 | polyadenylate-binding protein 1
Type:
Enzyme Catalytic Domain
Mol. Mass.:
70694.26
Organism:
Homo sapiens (Human)
Description:
gi_46367787
Residue:
636
  
Inhibitor
Name:
BDBM87652
Synonyms:
2-[4-oxidanylidene-3-(3-oxidanylpropyl)quinazolin-2-yl]sulfanyl-N-(phenylmethyl)ethanamide MLS000098563 N-benzyl-2-[[3-(3-hydroxypropyl)-4-keto-quinazolin-2-yl]thio]acetamide cid_2575543
Type:
Small organic molecule
Emp. Form.:
C20H21N3O3S
Mol. Mass.:
383.464
SMILES:
OCCCn1c(SCC(=O)NCc2ccccc2)nc2ccccc2c1=O
: