Target
Polyadenylate-binding protein 1
Ligand
BDBM87661
Substrate
Meas. Tech.
Dose-response confirmation of microRNA-mediated mRNA deadenylation inhibitors by fluoresence polarization assay
IC50
>66000±n/a nM
Citation
 PubChem, PC Dose-response confirmation of microRNA-mediated mRNA deadenylation inhibitors by fluoresence polarization assay PubChem Bioassay (2012)[AID] 
Target
Name:
Polyadenylate-binding protein 1
Synonyms:
PAB1 PABP1 PABPC1 poly(A) binding protein, cytoplasmic 1 | polyadenylate-binding protein 1
Type:
Enzyme Catalytic Domain
Mol. Mass.:
70694.26
Organism:
Homo sapiens (Human)
Description:
gi_46367787
Residue:
636
  
Inhibitor
Name:
BDBM87661
Synonyms:
5-ethyl-3-(4-methoxybenzyl)-1,3,5-thiadiazinane-2-thione 5-ethyl-3-p-anisyl-1,3,5-thiadiazinane-2-thione SMR000031239 | cid_3239950
Type:
Small organic molecule
Emp. Form.:
C13H18N2OS2
Mol. Mass.:
282.425
SMILES:
CCN1CSC(=S)N(Cc2ccc(OC)cc2)C1
: