Target
Polyadenylate-binding protein 1
Ligand
BDBM87689
Substrate
Meas. Tech.
Dose-response confirmation of microRNA-mediated mRNA deadenylation inhibitors by fluoresence polarization assay
IC50
>66000±n/a nM
Citation
 PubChem, PC Dose-response confirmation of microRNA-mediated mRNA deadenylation inhibitors by fluoresence polarization assay PubChem Bioassay (2012)[AID] 
Target
Name:
Polyadenylate-binding protein 1
Synonyms:
PAB1 PABP1 PABPC1 poly(A) binding protein, cytoplasmic 1 | polyadenylate-binding protein 1
Type:
Enzyme Catalytic Domain
Mol. Mass.:
70694.26
Organism:
Homo sapiens (Human)
Description:
gi_46367787
Residue:
636
  
Inhibitor
Name:
BDBM87689
Synonyms:
2-amino-4-(2-ethylsulfanylthiophen-3-yl)-5-oxo-1-pyridin-3-yl-4,6,7,8-tetrahydroquinoline-3-carbonitrile 2-amino-4-[2-(ethylthio)-3-thienyl]-5-oxo-1-(3-pyridinyl)-1,4,5,6,7,8-hexahydro-3-quinolinecarbonitrile 2-azanyl-4-(2-ethylsulfanylthiophen-3-yl)-5-oxidanylidene-1-pyridin-3-yl-4,6,7,8-tetrahydroquinoline-3-carbonitrile SMR000071191 | cid_2908583
Type:
Small organic molecule
Emp. Form.:
C21H20N4OS2
Mol. Mass.:
408.54
SMILES:
CCSc1sccc1C1C(C#N)C(=N)N(C2=C1C(=O)CCC2)c1cccnc1
: