Target
Polyadenylate-binding protein 1
Ligand
BDBM34433
Substrate
Meas. Tech.
Dose-response confirmation of microRNA-mediated mRNA deadenylation inhibitors by fluoresence polarization assay
IC50
>66000±n/a nM
Citation
 PubChem, PC Dose-response confirmation of microRNA-mediated mRNA deadenylation inhibitors by fluoresence polarization assay PubChem Bioassay (2012)[AID] 
Target
Name:
Polyadenylate-binding protein 1
Synonyms:
PAB1 PABP1 PABPC1 poly(A) binding protein, cytoplasmic 1 | polyadenylate-binding protein 1
Type:
Enzyme Catalytic Domain
Mol. Mass.:
70694.26
Organism:
Homo sapiens (Human)
Description:
gi_46367787
Residue:
636
  
Inhibitor
Name:
BDBM34433
Synonyms:
6-(phenylmethyl)-3-pyridin-4-yl-[1,2,4]triazolo[3,4-b][1,3,4]thiadiazole 6-benzyl-3-(4-pyridyl)-[1,2,4]triazolo[3,4-b][1,3,4]thiadiazole MLS000066522 cid_1234087
Type:
Small organic molecule
Emp. Form.:
C15H11N5S
Mol. Mass.:
293.346
SMILES:
C(c1nn2c(nnc2s1)-c1ccncc1)c1ccccc1
: