Target
Polyadenylate-binding protein 1
Ligand
BDBM41415
Substrate
Meas. Tech.
Dose-response confirmation of microRNA-mediated mRNA deadenylation inhibitors by fluoresence polarization assay
IC50
>66000±n/a nM
Citation
 PubChem, PC Dose-response confirmation of microRNA-mediated mRNA deadenylation inhibitors by fluoresence polarization assay PubChem Bioassay (2012)[AID] 
Target
Name:
Polyadenylate-binding protein 1
Synonyms:
PAB1 PABP1 PABPC1 poly(A) binding protein, cytoplasmic 1 | polyadenylate-binding protein 1
Type:
Enzyme Catalytic Domain
Mol. Mass.:
70694.26
Organism:
Homo sapiens (Human)
Description:
gi_46367787
Residue:
636
  
Inhibitor
Name:
BDBM41415
Synonyms:
2-(3,4-dihydro-1H-isoquinolin-2-ylmethyl)-1H-quinazolin-4-one MLS000088906 cid_751828
Type:
Small organic molecule
Emp. Form.:
C18H17N3O
Mol. Mass.:
291.3471
SMILES:
O=c1[nH]c(CN2CCc3ccccc3C2)nc2ccccc12
: