Target
Polyadenylate-binding protein 1
Ligand
BDBM87700
Substrate
Meas. Tech.
Dose-response confirmation of microRNA-mediated mRNA deadenylation inhibitors by fluoresence polarization assay
IC50
>66000±n/a nM
Citation
 PubChem, PC Dose-response confirmation of microRNA-mediated mRNA deadenylation inhibitors by fluoresence polarization assay PubChem Bioassay (2012)[AID] 
Target
Name:
Polyadenylate-binding protein 1
Synonyms:
PAB1 PABP1 PABPC1 poly(A) binding protein, cytoplasmic 1 | polyadenylate-binding protein 1
Type:
Enzyme Catalytic Domain
Mol. Mass.:
70694.26
Organism:
Homo sapiens (Human)
Description:
gi_46367787
Residue:
636
  
Inhibitor
Name:
BDBM87700
Synonyms:
MLS000116348 N-(3-cyano-4-ethyl-5-methyl-2-thiophenyl)-5-cyclopropyl-3-isoxazolecarboxamide N-(3-cyano-4-ethyl-5-methylthiophen-2-yl)-5-cyclopropyl-1,2-oxazole-3-carboxamide cid_5307447
Type:
Small organic molecule
Emp. Form.:
C15H15N3O2S
Mol. Mass.:
301.364
SMILES:
CCc1c(C)sc(NC(=O)c2cc(on2)C2CC2)c1C#N
: