Target
Polyadenylate-binding protein 1
Ligand
BDBM87672
Substrate
Meas. Tech.
Dose-response secondary confirmation of microRNA-mediated mRNA deadenylation inhibitors by fluoresence polarization assay using Cy5 labeled peptide
IC50
>66000±n/a nM
Citation
 PubChem, PC Dose-response secondary confirmation of microRNA-mediated mRNA deadenylation inhibitors by fluoresence polarization assay using Cy5 labeled peptide PubChem Bioassay (2012)[AID] 
Target
Name:
Polyadenylate-binding protein 1
Synonyms:
PAB1 PABP1 PABPC1 poly(A) binding protein, cytoplasmic 1 | polyadenylate-binding protein 1
Type:
Enzyme Catalytic Domain
Mol. Mass.:
70694.26
Organism:
Homo sapiens (Human)
Description:
gi_46367787
Residue:
636
  
Inhibitor
Name:
BDBM87672
Synonyms:
MLS000089486 N-[(1,2-dimethylindol-5-yl)methyl]-1,3-benzodioxole-5-carboxamide SMR000016557 | cid_3242977
Type:
Small organic molecule
Emp. Form.:
C19H18N2O3
Mol. Mass.:
322.3578
SMILES:
Cc1cc2cc(CNC(=O)c3ccc4OCOc4c3)ccc2n1C
: