Target
Melanocortin receptor 4
Ligand
BDBM65098
Substrate
Meas. Tech.
Luminescence-based cell-based high throughput dose response assay for biased ligands (agonists) of the melanocortin 4 receptor (MC4R)
EC50
>9912±n/a nM
Citation
 PubChem, PC Luminescence-based cell-based high throughput dose response assay for biased ligands (agonists) of the melanocortin 4 receptor (MC4R) PubChem Bioassay (2012)[AID] 
Target
Name:
Melanocortin receptor 4
Synonyms:
MC4-R MC4R_HUMAN Melanocortin receptor 4 (MC-4) Melanocortin receptor 4 (MC4R)
Type:
Enzyme
Mol. Mass.:
36949.50
Organism:
Homo sapiens (Human)
Description:
P32245
Residue:
332
  
Inhibitor
Name:
BDBM65098
Synonyms:
4-[4-(4-chlorophenyl)-1,3-thiazol-2-yl]-N-[3-(dimethylamino)propyl]benzamide 4-[4-(4-chlorophenyl)-2-thiazolyl]-N-[3-(dimethylamino)propyl]benzamide MLS000546266 cid_3734285
Type:
Small organic molecule
Emp. Form.:
C21H22ClN3OS
Mol. Mass.:
399.937
SMILES:
CN(C)CCCNC(=O)c1ccc(cc1)-c1nc(cs1)-c1ccc(Cl)cc1
: