Target
Melanocortin receptor 4
Ligand
BDBM88434
Substrate
Meas. Tech.
Luminescence-based cell-based high throughput dose response assay for biased ligands (agonists) of the melanocortin 4 receptor (MC4R)
EC50
>89224±n/a nM
Citation
 PubChem, PC Luminescence-based cell-based high throughput dose response assay for biased ligands (agonists) of the melanocortin 4 receptor (MC4R) PubChem Bioassay (2012)[AID] 
Target
Name:
Melanocortin receptor 4
Synonyms:
MC4-R MC4R_HUMAN Melanocortin receptor 4 (MC-4) Melanocortin receptor 4 (MC4R)
Type:
Enzyme
Mol. Mass.:
36949.50
Organism:
Homo sapiens (Human)
Description:
P32245
Residue:
332
  
Inhibitor
Name:
BDBM88434
Synonyms:
MLS000325634 N-(3,4-dichlorophenyl)-3-[(4-methoxyphenyl)methoxy]-2-thiophenecarboxamide N-(3,4-dichlorophenyl)-3-p-anisyloxy-thiophene-2-carboxamide cid_3365190
Type:
Small organic molecule
Emp. Form.:
C19H15Cl2NO3S
Mol. Mass.:
408.298
SMILES:
COc1ccc(COc2ccsc2C(=O)Nc2ccc(Cl)c(Cl)c2)cc1
: