Target
Melanocortin receptor 4
Ligand
BDBM57456
Substrate
Meas. Tech.
Luminescence-based cell-based high throughput dose response assay for biased ligands (agonists) of the melanocortin 4 receptor (MC4R)
EC50
>89188±n/a nM
Citation
 PubChem, PC Luminescence-based cell-based high throughput dose response assay for biased ligands (agonists) of the melanocortin 4 receptor (MC4R) PubChem Bioassay (2012)[AID] 
Target
Name:
Melanocortin receptor 4
Synonyms:
MC4-R MC4R_HUMAN Melanocortin receptor 4 (MC-4) Melanocortin receptor 4 (MC4R)
Type:
Enzyme
Mol. Mass.:
36949.50
Organism:
Homo sapiens (Human)
Description:
P32245
Residue:
332
  
Inhibitor
Name:
BDBM57456
Synonyms:
(4Z)-4-[[3-(4-chlorophenyl)-1-phenyl-4-pyrazolyl]methylidene]-3-methyl-1H-pyrazol-5-one (4Z)-4-[[3-(4-chlorophenyl)-1-phenyl-pyrazol-4-yl]methylidene]-3-methyl-1H-pyrazol-5-one 4-{[3-(4-chlorophenyl)-1-phenyl-1H-pyrazol-4-yl]methylene}-5-methyl-2,4-dihydro-3H-pyrazol-3-one SMR000193592 | cid_5508807
Type:
Small organic molecule
Emp. Form.:
C20H15ClN4O
Mol. Mass.:
362.812
SMILES:
Clc1ccc(cc1)-c1nn(cc1C=c1c(=C)[nH][nH]c1=O)-c1ccccc1
: