Target
Melanocortin receptor 4
Ligand
BDBM55756
Substrate
Meas. Tech.
Luminescence-based cell-based high throughput dose response assay for biased ligands (agonists) of the melanocortin 4 receptor (MC4R)
EC50
>89210±n/a nM
Citation
 PubChem, PC Luminescence-based cell-based high throughput dose response assay for biased ligands (agonists) of the melanocortin 4 receptor (MC4R) PubChem Bioassay (2012)[AID] 
Target
Name:
Melanocortin receptor 4
Synonyms:
MC4-R MC4R_HUMAN Melanocortin receptor 4 (MC-4) Melanocortin receptor 4 (MC4R)
Type:
Enzyme
Mol. Mass.:
36949.50
Organism:
Homo sapiens (Human)
Description:
P32245
Residue:
332
  
Inhibitor
Name:
BDBM55756
Synonyms:
1-(dodecoxymethyl)-3-methyl-benzimidazol-3-ium;chloride 1-(lauryloxymethyl)-3-methyl-benzimidazol-3-ium;chloride SMR000283698 | cid_16192647
Type:
Small organic molecule
Emp. Form.:
C21H35N2O
Mol. Mass.:
331.5149
SMILES:
CCCCCCCCCCCCOCn1c[n+](C)c2ccccc12
: