Target
Melanocortin receptor 4
Ligand
BDBM88465
Substrate
Meas. Tech.
Luminescence-based cell-based high throughput dose response assay for biased ligands (agonists) of the melanocortin 4 receptor (MC4R)
EC50
>89197±n/a nM
Citation
 PubChem, PC Luminescence-based cell-based high throughput dose response assay for biased ligands (agonists) of the melanocortin 4 receptor (MC4R) PubChem Bioassay (2012)[AID] 
Target
Name:
Melanocortin receptor 4
Synonyms:
MC4-R MC4R_HUMAN Melanocortin receptor 4 (MC-4) Melanocortin receptor 4 (MC4R)
Type:
Enzyme
Mol. Mass.:
36949.50
Organism:
Homo sapiens (Human)
Description:
P32245
Residue:
332
  
Inhibitor
Name:
BDBM88465
Synonyms:
3-[(5Z)-4-keto-5-[(E)-3-phenylprop-2-enylidene]-2-thioxo-thiazolidin-3-yl]-N-(2-pyridyl)propionamide 3-[(5Z)-4-oxo-5-[(E)-3-phenylprop-2-enylidene]-2-sulfanylidene-1,3-thiazolidin-3-yl]-N-pyridin-2-ylpropanamide 3-[4-oxo-5-(3-phenyl-2-propen-1-ylidene)-2-thioxo-1,3-thiazolidin-3-yl]-N-2-pyridinylpropanamide SMR000270610 | cid_1321526
Type:
Small organic molecule
Emp. Form.:
C20H17N3O2S2
Mol. Mass.:
395.498
SMILES:
O=C(CCN1C(=S)S\C(=C/C=C/c2ccccc2)C1=O)Nc1ccccn1
: