Target
Melanocortin receptor 4
Ligand
BDBM88468
Substrate
Meas. Tech.
Luminescence-based cell-based high throughput dose response assay for biased ligands (agonists) of the melanocortin 4 receptor (MC4R)
EC50
>89245±n/a nM
Citation
 PubChem, PC Luminescence-based cell-based high throughput dose response assay for biased ligands (agonists) of the melanocortin 4 receptor (MC4R) PubChem Bioassay (2012)[AID] 
Target
Name:
Melanocortin receptor 4
Synonyms:
MC4-R MC4R_HUMAN Melanocortin receptor 4 (MC-4) Melanocortin receptor 4 (MC4R)
Type:
Enzyme
Mol. Mass.:
36949.50
Organism:
Homo sapiens (Human)
Description:
P32245
Residue:
332
  
Inhibitor
Name:
BDBM88468
Synonyms:
(E)-3-(2,3-dihydro-1,4-benzodioxin-6-yl)-1-(2-hydroxy-5-methyl-phenyl)prop-2-en-1-one (E)-3-(2,3-dihydro-1,4-benzodioxin-6-yl)-1-(2-hydroxy-5-methylphenyl)prop-2-en-1-one 3-(2,3-dihydro-1,4-benzodioxin-6-yl)-1-(2-hydroxy-5-methylphenyl)prop-2-en- 1-one SMR000312578 | cid_5709345
Type:
Small organic molecule
Emp. Form.:
C18H16O4
Mol. Mass.:
296.3172
SMILES:
Cc1ccc(O)c(c1)C(=O)\C=C\c1ccc2OCCOc2c1
: