Target
Melanocortin receptor 4
Ligand
BDBM88470
Substrate
Meas. Tech.
Luminescence-based cell-based high throughput dose response assay for biased ligands (agonists) of the melanocortin 4 receptor (MC4R)
EC50
>89222±n/a nM
Citation
 PubChem, PC Luminescence-based cell-based high throughput dose response assay for biased ligands (agonists) of the melanocortin 4 receptor (MC4R) PubChem Bioassay (2012)[AID] 
Target
Name:
Melanocortin receptor 4
Synonyms:
MC4-R MC4R_HUMAN Melanocortin receptor 4 (MC-4) Melanocortin receptor 4 (MC4R)
Type:
Enzyme
Mol. Mass.:
36949.50
Organism:
Homo sapiens (Human)
Description:
P32245
Residue:
332
  
Inhibitor
Name:
BDBM88470
Synonyms:
2-[1,3-bis(oxidanylidene)isoindol-2-yl]-N-[3-(dimethylamino)propyl]-N-(4,5-dimethyl-1,3-benzothiazol-2-yl)ethanamide;hydrochloride N-[3-(dimethylamino)propyl]-N-(4,5-dimethyl-1,3-benzothiazol-2-yl)-2-(1,3-dioxo-2-isoindolyl)acetamide;hydrochloride N-[3-(dimethylamino)propyl]-N-(4,5-dimethyl-1,3-benzothiazol-2-yl)-2-phthalimido-acetamide;hydrochloride cid_16194869
Type:
Small organic molecule
Emp. Form.:
C24H26N4O3S
Mol. Mass.:
450.553
SMILES:
CN(C)CCCN(C(=O)CN1C(=O)c2ccccc2C1=O)c1nc2c(C)c(C)ccc2s1
: