Target
Melanocortin receptor 4
Ligand
BDBM51903
Substrate
Meas. Tech.
Luminescence-based cell-based high throughput dose response assay for biased ligands (agonists) of the melanocortin 4 receptor (MC4R)
EC50
>89208±n/a nM
Citation
 PubChem, PC Luminescence-based cell-based high throughput dose response assay for biased ligands (agonists) of the melanocortin 4 receptor (MC4R) PubChem Bioassay (2012)[AID] 
Target
Name:
Melanocortin receptor 4
Synonyms:
MC4-R MC4R_HUMAN Melanocortin receptor 4 (MC-4) Melanocortin receptor 4 (MC4R)
Type:
Enzyme
Mol. Mass.:
36949.50
Organism:
Homo sapiens (Human)
Description:
P32245
Residue:
332
  
Inhibitor
Name:
BDBM51903
Synonyms:
1-Decyloxycarbonylmethyl-2-(4-methoxy-phenoxymethyl)-3-methyl-3H-benzoimidazol-1-ium 2-[2-[(4-methoxyphenoxy)methyl]-3-methyl-benzimidazol-3-ium-1-yl]acetic acid decyl ester;chloride SMR000505011 decyl 2-[2-[(4-methoxyphenoxy)methyl]-3-methyl-benzimidazol-3-ium-1-yl]ethanoate;chloride | decyl 2-[2-[(4-methoxyphenoxy)methyl]-3-methylbenzimidazol-3-ium-1-yl]acetate;chloride
Type:
Small organic molecule
Emp. Form.:
C28H39N2O4
Mol. Mass.:
467.6197
SMILES:
CCCCCCCCCCOC(=O)Cn1c(COc2ccc(OC)cc2)[n+](C)c2ccccc12
: