Target
Melanocortin receptor 4
Ligand
BDBM79115
Substrate
Meas. Tech.
Luminescence-based cell-based high throughput dose response assay for biased ligands (agonists) of the melanocortin 4 receptor (MC4R)
EC50
>89198±n/a nM
Citation
 PubChem, PC Luminescence-based cell-based high throughput dose response assay for biased ligands (agonists) of the melanocortin 4 receptor (MC4R) PubChem Bioassay (2012)[AID] 
Target
Name:
Melanocortin receptor 4
Synonyms:
MC4-R MC4R_HUMAN Melanocortin receptor 4 (MC-4) Melanocortin receptor 4 (MC4R)
Type:
Enzyme
Mol. Mass.:
36949.50
Organism:
Homo sapiens (Human)
Description:
P32245
Residue:
332
  
Inhibitor
Name:
BDBM79115
Synonyms:
4-[[3-(4-chlorophenyl)-2-isoxazolin-5-yl]methyl]-N-heptyl-isonipecotamide 4-[[3-(4-chlorophenyl)-4,5-dihydro-1,2-oxazol-5-yl]methyl]-N-heptylpiperidine-4-carboxamide MLS001144009 cid_24818153
Type:
Small organic molecule
Emp. Form.:
C23H34ClN3O2
Mol. Mass.:
419.988
SMILES:
CCCCCCCNC(=O)C1(CC2CC(=NO2)c2ccc(Cl)cc2)CCNCC1
: