Target
Melanocortin receptor 4
Ligand
BDBM48700
Substrate
Meas. Tech.
Luminescence-based cell-based high throughput dose response assay for biased ligands (agonists) of the melanocortin 4 receptor (MC4R)
EC50
>89213±n/a nM
Citation
 PubChem, PC Luminescence-based cell-based high throughput dose response assay for biased ligands (agonists) of the melanocortin 4 receptor (MC4R) PubChem Bioassay (2012)[AID] 
Target
Name:
Melanocortin receptor 4
Synonyms:
MC4-R MC4R_HUMAN Melanocortin receptor 4 (MC-4) Melanocortin receptor 4 (MC4R)
Type:
Enzyme
Mol. Mass.:
36949.50
Organism:
Homo sapiens (Human)
Description:
P32245
Residue:
332
  
Inhibitor
Name:
BDBM48700
Synonyms:
MLS000582167 N-(4-acetylphenyl)-2-[(3-ethyl-4-oxo-3,4,6,7,8,9-hexahydropyrimido[4,5-b]quinolin-2-yl)thio]acetamide N-(4-acetylphenyl)-2-[(3-ethyl-4-oxo-6,7,8,9-tetrahydropyrimido[4,5-b]quinolin-2-yl)thio]acetamide SMR000200701 | cid_1996177
Type:
Small organic molecule
Emp. Form.:
C23H24N4O3S
Mol. Mass.:
436.527
SMILES:
CCn1c(SCC(=O)Nc2ccc(cc2)C(C)=O)nc2nc3CCCCc3cc2c1=O
: