Target
Melanocortin receptor 4
Ligand
BDBM88525
Substrate
Meas. Tech.
Luminescence-based cell-based high throughput dose response assay for biased ligands (agonists) of the melanocortin 4 receptor (MC4R)
EC50
>89214±n/a nM
Citation
 PubChem, PC Luminescence-based cell-based high throughput dose response assay for biased ligands (agonists) of the melanocortin 4 receptor (MC4R) PubChem Bioassay (2012)[AID] 
Target
Name:
Melanocortin receptor 4
Synonyms:
MC4-R MC4R_HUMAN Melanocortin receptor 4 (MC-4) Melanocortin receptor 4 (MC4R)
Type:
Enzyme
Mol. Mass.:
36949.50
Organism:
Homo sapiens (Human)
Description:
P32245
Residue:
332
  
Inhibitor
Name:
BDBM88525
Synonyms:
N-[4-[1-amino-2-[4-(trifluoromethyl)phenyl]ethyl]-1,3-thiazol-2-yl]-4-methylbenzamide N-[4-[1-amino-2-[4-(trifluoromethyl)phenyl]ethyl]thiazol-2-yl]-4-methyl-benzamide cid_46948559
Type:
Small organic molecule
Emp. Form.:
C20H18F3N3OS
Mol. Mass.:
405.437
SMILES:
Cc1ccc(cc1)C(=O)Nc1nc(cs1)C(N)Cc1ccc(cc1)C(F)(F)F
: