Target
Delta-type opioid receptor
Ligand
BDBM88420
Substrate
Meas. Tech.
Counterscreen for biased ligands (agonists) of the melanocortin 4 receptor (MC4R)
EC50
>92446±n/a nM
Citation
 PubChem, PC Counterscreen for biased ligands (agonists) of the melanocortin 4 receptor (MC4R): Luminescence-based cell-based high throughput dose response assay to identify agonists of heterodimerization of the mu 1 (OPRM1) and delta 1 (OPRD1) opioid receptors PubChem Bioassay (2012)[AID] 
Target
Name:
Delta-type opioid receptor
Synonyms:
D-OR-1 Delta opioid receptor OPIATE Delta OPRD1 OPRK1 | opioid receptor, delta 1
Type:
G Protein-Coupled Receptor (GPCR)
Mol. Mass.:
40382.98
Organism:
Homo sapiens (Human)
Description:
Competition binding assays were carried out using membrane preparations from transfected HN9.10 cells that constitutively expressed the delta opioid receptor.
Residue:
372
  
Inhibitor
Name:
BDBM88420
Synonyms:
2-amino-1-[(E)-3-pyridylmethyleneamino]-N-sec-butyl-pyrrolo[3,2-b]quinoxaline-3-carboxamide 2-amino-N-butan-2-yl-1-[(E)-pyridin-3-ylmethylideneamino]pyrrolo[3,2-b]quinoxaline-3-carboxamide MLS000040301 cid_9568667
Type:
Small organic molecule
Emp. Form.:
C21H21N7O
Mol. Mass.:
387.4377
SMILES:
CCC(C)NC(=O)c1c(N)n(\N=C\c2cccnc2)c2nc3ccccc3nc12
: