Target
Delta-type opioid receptor
Ligand
BDBM59898
Substrate
Meas. Tech.
Counterscreen for biased ligands (agonists) of the melanocortin 4 receptor (MC4R)
EC50
>64592±n/a nM
Citation
 PubChem, PC Counterscreen for biased ligands (agonists) of the melanocortin 4 receptor (MC4R): Luminescence-based cell-based high throughput dose response assay to identify agonists of heterodimerization of the mu 1 (OPRM1) and delta 1 (OPRD1) opioid receptors PubChem Bioassay (2012)[AID] 
Target
Name:
Delta-type opioid receptor
Synonyms:
D-OR-1 Delta opioid receptor OPIATE Delta OPRD1 OPRK1 | opioid receptor, delta 1
Type:
G Protein-Coupled Receptor (GPCR)
Mol. Mass.:
40382.98
Organism:
Homo sapiens (Human)
Description:
Competition binding assays were carried out using membrane preparations from transfected HN9.10 cells that constitutively expressed the delta opioid receptor.
Residue:
372
  
Inhibitor
Name:
BDBM59898
Synonyms:
6-amino-4-[(E)-1-(2-furanyl)prop-1-en-2-yl]-3-(4-methylphenyl)-2,4-dihydropyrano[2,3-c]pyrazole-5-carbonitrile 6-amino-4-[(E)-2-(2-furyl)-1-methyl-vinyl]-3-(p-tolyl)-2,4-dihydropyrano[2,3-c]pyrazole-5-carbonitrile MLS000519110 cid_11957202
Type:
Small organic molecule
Emp. Form.:
C21H18N4O2
Mol. Mass.:
358.3932
SMILES:
C\C(=C/c1ccco1)C1C(C#N)C(=N)Oc2[nH]nc(c12)-c1ccc(C)cc1
: