Target
Delta-type opioid receptor
Ligand
BDBM57475
Substrate
Meas. Tech.
Counterscreen for biased ligands (agonists) of the melanocortin 4 receptor (MC4R)
EC50
>10272±n/a nM
Citation
 PubChem, PC Counterscreen for biased ligands (agonists) of the melanocortin 4 receptor (MC4R): Luminescence-based cell-based high throughput dose response assay to identify agonists of heterodimerization of the mu 1 (OPRM1) and delta 1 (OPRD1) opioid receptors PubChem Bioassay (2012)[AID] 
Target
Name:
Delta-type opioid receptor
Synonyms:
D-OR-1 Delta opioid receptor OPIATE Delta OPRD1 OPRK1 | opioid receptor, delta 1
Type:
G Protein-Coupled Receptor (GPCR)
Mol. Mass.:
40382.98
Organism:
Homo sapiens (Human)
Description:
Competition binding assays were carried out using membrane preparations from transfected HN9.10 cells that constitutively expressed the delta opioid receptor.
Residue:
372
  
Inhibitor
Name:
BDBM57475
Synonyms:
2-({1-[2-hydroxy-3-(2-naphthyloxy)propyl]-4-piperidinyl}methyl)-1H-benzo[de]isoquinoline-1,3(2H)-dione hydrochloride 2-[[1-(3-naphthalen-2-yloxy-2-oxidanyl-propyl)piperidin-4-yl]methyl]benzo[de]isoquinoline-1,3-dione;hydrochloride 2-[[1-[2-hydroxy-3-(2-naphthoxy)propyl]-4-piperidyl]methyl]benzo[de]isoquinoline-1,3-quinone;hydrochloride SMR000194544 | cid_2891886
Type:
Small organic molecule
Emp. Form.:
C31H30N2O4
Mol. Mass.:
494.5809
SMILES:
OC(COc1ccc2ccccc2c1)CN1CCC(CN2C(=O)c3cccc4cccc(C2=O)c34)CC1
: