Target
Delta-type opioid receptor
Ligand
BDBM74865
Substrate
Meas. Tech.
Counterscreen for biased ligands (agonists) of the melanocortin 4 receptor (MC4R)
EC50
>64560±n/a nM
Citation
 PubChem, PC Counterscreen for biased ligands (agonists) of the melanocortin 4 receptor (MC4R): Luminescence-based cell-based high throughput dose response assay to identify agonists of heterodimerization of the mu 1 (OPRM1) and delta 1 (OPRD1) opioid receptors PubChem Bioassay (2012)[AID] 
Target
Name:
Delta-type opioid receptor
Synonyms:
D-OR-1 Delta opioid receptor OPIATE Delta OPRD1 OPRK1 | opioid receptor, delta 1
Type:
G Protein-Coupled Receptor (GPCR)
Mol. Mass.:
40382.98
Organism:
Homo sapiens (Human)
Description:
Competition binding assays were carried out using membrane preparations from transfected HN9.10 cells that constitutively expressed the delta opioid receptor.
Residue:
372
  
Inhibitor
Name:
BDBM74865
Synonyms:
(E)-2-cyano-3-[5-(4-fluorophenyl)-2-furanyl]-N-(4-thiophen-2-yl-2-thiazolyl)-2-propenamide (E)-2-cyano-3-[5-(4-fluorophenyl)furan-2-yl]-N-(4-thiophen-2-yl-1,3-thiazol-2-yl)prop-2-enamide SMR000262229 | cid_2328888
Type:
Small organic molecule
Emp. Form.:
C21H12FN3O2S2
Mol. Mass.:
421.467
SMILES:
Fc1ccc(cc1)-c1ccc(\C=C(/C#N)C(=O)Nc2nc(cs2)-c2cccs2)o1
: