Target
Delta-type opioid receptor
Ligand
BDBM48700
Substrate
Meas. Tech.
Counterscreen for biased ligands (agonists) of the melanocortin 4 receptor (MC4R)
EC50
>64592±n/a nM
Citation
 PubChem, PC Counterscreen for biased ligands (agonists) of the melanocortin 4 receptor (MC4R): Luminescence-based cell-based high throughput dose response assay to identify agonists of heterodimerization of the mu 1 (OPRM1) and delta 1 (OPRD1) opioid receptors PubChem Bioassay (2012)[AID] 
Target
Name:
Delta-type opioid receptor
Synonyms:
D-OR-1 Delta opioid receptor OPIATE Delta OPRD1 OPRK1 | opioid receptor, delta 1
Type:
G Protein-Coupled Receptor (GPCR)
Mol. Mass.:
40382.98
Organism:
Homo sapiens (Human)
Description:
Competition binding assays were carried out using membrane preparations from transfected HN9.10 cells that constitutively expressed the delta opioid receptor.
Residue:
372
  
Inhibitor
Name:
BDBM48700
Synonyms:
MLS000582167 N-(4-acetylphenyl)-2-[(3-ethyl-4-oxo-3,4,6,7,8,9-hexahydropyrimido[4,5-b]quinolin-2-yl)thio]acetamide N-(4-acetylphenyl)-2-[(3-ethyl-4-oxo-6,7,8,9-tetrahydropyrimido[4,5-b]quinolin-2-yl)thio]acetamide SMR000200701 | cid_1996177
Type:
Small organic molecule
Emp. Form.:
C23H24N4O3S
Mol. Mass.:
436.527
SMILES:
CCn1c(SCC(=O)Nc2ccc(cc2)C(C)=O)nc2nc3CCCCc3cc2c1=O
: