Target
Delta-type opioid receptor
Ligand
BDBM88505
Substrate
Meas. Tech.
Counterscreen for biased ligands (agonists) of the melanocortin 4 receptor (MC4R)
EC50
>92508±n/a nM
Citation
 PubChem, PC Counterscreen for biased ligands (agonists) of the melanocortin 4 receptor (MC4R): Luminescence-based cell-based high throughput dose response assay to identify agonists of heterodimerization of the mu 1 (OPRM1) and delta 1 (OPRD1) opioid receptors PubChem Bioassay (2012)[AID] 
Target
Name:
Delta-type opioid receptor
Synonyms:
D-OR-1 Delta opioid receptor OPIATE Delta OPRD1 OPRK1 | opioid receptor, delta 1
Type:
G Protein-Coupled Receptor (GPCR)
Mol. Mass.:
40382.98
Organism:
Homo sapiens (Human)
Description:
Competition binding assays were carried out using membrane preparations from transfected HN9.10 cells that constitutively expressed the delta opioid receptor.
Residue:
372
  
Inhibitor
Name:
BDBM88505
Synonyms:
1-[4-[amino(phenyl)methyl]-1,3-thiazol-2-yl]-3-(2-phenoxyphenyl)urea 1-[4-[amino(phenyl)methyl]thiazol-2-yl]-3-(2-phenoxyphenyl)urea MLS003123949 cid_46942493
Type:
Small organic molecule
Emp. Form.:
C23H20N4O2S
Mol. Mass.:
416.496
SMILES:
NC(c1csc(NC(=O)Nc2ccccc2Oc2ccccc2)n1)c1ccccc1
: