Target
Delta-type opioid receptor
Ligand
BDBM88518
Substrate
Meas. Tech.
Counterscreen for biased ligands (agonists) of the melanocortin 4 receptor (MC4R)
EC50
>64565±n/a nM
Citation
 PubChem, PC Counterscreen for biased ligands (agonists) of the melanocortin 4 receptor (MC4R): Luminescence-based cell-based high throughput dose response assay to identify agonists of heterodimerization of the mu 1 (OPRM1) and delta 1 (OPRD1) opioid receptors PubChem Bioassay (2012)[AID] 
Target
Name:
Delta-type opioid receptor
Synonyms:
D-OR-1 Delta opioid receptor OPIATE Delta OPRD1 OPRK1 | opioid receptor, delta 1
Type:
G Protein-Coupled Receptor (GPCR)
Mol. Mass.:
40382.98
Organism:
Homo sapiens (Human)
Description:
Competition binding assays were carried out using membrane preparations from transfected HN9.10 cells that constitutively expressed the delta opioid receptor.
Residue:
372
  
Inhibitor
Name:
BDBM88518
Synonyms:
MLS003124246 N-[6-(3,4-dimethoxyphenyl)-3-[3-(trifluoromethyl)phenyl]imidazo[1,2-a]pyridin-8-yl]formamide SMR001292781 | cid_46944097
Type:
Small organic molecule
Emp. Form.:
C23H18F3N3O3
Mol. Mass.:
441.4025
SMILES:
COc1ccc(cc1OC)-c1cc(NC=O)c2ncc(-c3cccc(c3)C(F)(F)F)n2c1
: