Target
Melanocortin receptor 4
Ligand
BDBM88569
Substrate
Meas. Tech.
TRFRET-based cell-based high throughput dose response assay for biased ligands (antagonists) of the melanocortin 4 receptor (MC4R)
IC50
>64562±n/a nM
Citation
 PubChem, PC TRFRET-based cell-based high throughput dose response assay for biased ligands (antagonists) of the melanocortin 4 receptor (MC4R) PubChem Bioassay (2012)[AID] 
Target
Name:
Melanocortin receptor 4
Synonyms:
MC4-R MC4R_HUMAN Melanocortin receptor 4 (MC-4) Melanocortin receptor 4 (MC4R)
Type:
Enzyme
Mol. Mass.:
36949.50
Organism:
Homo sapiens (Human)
Description:
P32245
Residue:
332
  
Inhibitor
Name:
BDBM88569
Synonyms:
2-[[5-(4-piperidinosulfonylphenyl)-1,3,4-oxadiazol-2-yl]thio]acetic acid methyl ester MLS000074183 cid_648859 methyl 2-[[5-(4-piperidin-1-ylsulfonylphenyl)-1,3,4-oxadiazol-2-yl]sulfanyl]ethanoate | {5-[4-(Piperidine-1-sulfonyl)-phenyl]-[1,3,4]oxadiazol-2-ylsulfanyl}-acetic acid methyl ester
Type:
Small organic molecule
Emp. Form.:
C16H19N3O5S2
Mol. Mass.:
397.469
SMILES:
COC(=O)CSc1nnc(o1)-c1ccc(cc1)S(=O)(=O)N1CCCCC1
: