Target
Melanocortin receptor 4
Ligand
BDBM88578
Substrate
Meas. Tech.
TRFRET-based cell-based high throughput dose response assay for biased ligands (antagonists) of the melanocortin 4 receptor (MC4R)
IC50
>64565±n/a nM
Citation
 PubChem, PC TRFRET-based cell-based high throughput dose response assay for biased ligands (antagonists) of the melanocortin 4 receptor (MC4R) PubChem Bioassay (2012)[AID] 
Target
Name:
Melanocortin receptor 4
Synonyms:
MC4-R MC4R_HUMAN Melanocortin receptor 4 (MC-4) Melanocortin receptor 4 (MC4R)
Type:
Enzyme
Mol. Mass.:
36949.50
Organism:
Homo sapiens (Human)
Description:
P32245
Residue:
332
  
Inhibitor
Name:
BDBM88578
Synonyms:
3-[4-(2-furoyl)piperazino]-1-phenyl-5,6,7,8-tetrahydroisoquinoline-4-carbonitrile 3-[4-(furan-2-ylcarbonyl)piperazin-1-yl]-1-phenyl-5,6,7,8-tetrahydroisoquinoline-4-carbonitrile MLS000112457 cid_1321203
Type:
Small organic molecule
Emp. Form.:
C25H24N4O2
Mol. Mass.:
412.4837
SMILES:
O=C(N1CCN(CC1)c1nc(-c2ccccc2)c2CCCCc2c1C#N)c1ccco1
: