Target
Melanocortin receptor 4
Ligand
BDBM67173
Substrate
Meas. Tech.
TRFRET-based cell-based high throughput dose response assay for biased ligands (antagonists) of the melanocortin 4 receptor (MC4R)
IC50
>64565±n/a nM
Citation
 PubChem, PC TRFRET-based cell-based high throughput dose response assay for biased ligands (antagonists) of the melanocortin 4 receptor (MC4R) PubChem Bioassay (2012)[AID] 
Target
Name:
Melanocortin receptor 4
Synonyms:
MC4-R MC4R_HUMAN Melanocortin receptor 4 (MC-4) Melanocortin receptor 4 (MC4R)
Type:
Enzyme
Mol. Mass.:
36949.50
Organism:
Homo sapiens (Human)
Description:
P32245
Residue:
332
  
Inhibitor
Name:
BDBM67173
Synonyms:
7-Chloro-4-isobutyl-2,3-dihydro-1H-6-oxa-5,8,10-triaza-cyclopenta[c]fluorene SMR000149442 | cid_2027229
Type:
Small organic molecule
Emp. Form.:
C16H16ClN3O
Mol. Mass.:
301.771
SMILES:
CC(C)Cc1nc2oc3c(Cl)ncnc3c2c2CCCc12
: