Target
Melanocortin receptor 4
Ligand
BDBM67917
Substrate
Meas. Tech.
TRFRET-based cell-based high throughput dose response assay for biased ligands (antagonists) of the melanocortin 4 receptor (MC4R)
IC50
2515±n/a nM
Citation
 PubChem, PC TRFRET-based cell-based high throughput dose response assay for biased ligands (antagonists) of the melanocortin 4 receptor (MC4R) PubChem Bioassay (2012)[AID] 
Target
Name:
Melanocortin receptor 4
Synonyms:
MC4-R MC4R_HUMAN Melanocortin receptor 4 (MC-4) Melanocortin receptor 4 (MC4R)
Type:
Enzyme
Mol. Mass.:
36949.50
Organism:
Homo sapiens (Human)
Description:
P32245
Residue:
332
  
Inhibitor
Name:
BDBM67917
Synonyms:
MLS000555378 N-[2-(cyclopentylamino)-2-oxidanylidene-1-thiophen-2-yl-ethyl]-N-(3,4-dimethoxyphenyl)prop-2-ynamide;hydrochloride N-[2-(cyclopentylamino)-2-oxo-1-thiophen-2-ylethyl]-N-(3,4-dimethoxyphenyl)prop-2-ynamide;hydrochloride SMR000173282 | cid_11958738
Type:
Small organic molecule
Emp. Form.:
C22H24N2O4S
Mol. Mass.:
412.502
SMILES:
COc1ccc(cc1OC)N(C(C(=O)NC1CCCC1)c1cccs1)C(=O)C#C
: