Target
Melanocortin receptor 4
Ligand
BDBM47770
Substrate
Meas. Tech.
TRFRET-based cell-based high throughput dose response assay for biased ligands (antagonists) of the melanocortin 4 receptor (MC4R)
IC50
>64579±n/a nM
Citation
 PubChem, PC TRFRET-based cell-based high throughput dose response assay for biased ligands (antagonists) of the melanocortin 4 receptor (MC4R) PubChem Bioassay (2012)[AID] 
Target
Name:
Melanocortin receptor 4
Synonyms:
MC4-R MC4R_HUMAN Melanocortin receptor 4 (MC-4) Melanocortin receptor 4 (MC4R)
Type:
Enzyme
Mol. Mass.:
36949.50
Organism:
Homo sapiens (Human)
Description:
P32245
Residue:
332
  
Inhibitor
Name:
BDBM47770
Synonyms:
4-[5-[(2,2-dimethyl-4,6-dioxo-1,3-dioxan-5-ylidene)methyl]-2-furanyl]benzenesulfonamide 4-[5-[(4,6-diketo-2,2-dimethyl-1,3-dioxan-5-ylidene)methyl]-2-furyl]benzenesulfonamide MLS000703574 cid_1154580
Type:
Small organic molecule
Emp. Form.:
C17H15NO7S
Mol. Mass.:
377.369
SMILES:
[#6]C1([#6])[#8]-[#6](=O)\[#6](=[#6]/c2ccc(o2)-c2ccc(cc2)S([#7])(=O)=O)-[#6](=O)-[#8]1
: