Target
Melanocortin receptor 4
Ligand
BDBM88643
Substrate
Meas. Tech.
TRFRET-based cell-based high throughput dose response assay for biased ligands (antagonists) of the melanocortin 4 receptor (MC4R)
IC50
15525±n/a nM
Citation
 PubChem, PC TRFRET-based cell-based high throughput dose response assay for biased ligands (antagonists) of the melanocortin 4 receptor (MC4R) PubChem Bioassay (2012)[AID] 
Target
Name:
Melanocortin receptor 4
Synonyms:
MC4-R MC4R_HUMAN Melanocortin receptor 4 (MC-4) Melanocortin receptor 4 (MC4R)
Type:
Enzyme
Mol. Mass.:
36949.50
Organism:
Homo sapiens (Human)
Description:
P32245
Residue:
332
  
Inhibitor
Name:
BDBM88643
Synonyms:
2,2,10-Trimethyl-5-morpholin-4-yl-8-phenyl-1,4-dihydro-2H-3-oxa-7-thia-6,11-diaza-benzo[c]fluorene-9- carboxylic acid SMR000413128 | cid_1831123
Type:
Small organic molecule
Emp. Form.:
C27H27N3O4S
Mol. Mass.:
489.586
SMILES:
Cc1nc2c(sc3nc(N4CCOCC4)c4COC(C)(C)Cc4c23)c(-c2ccccc2)c1C(O)=O
: