Target
Melanocortin receptor 4
Ligand
BDBM68180
Substrate
Meas. Tech.
TRFRET-based cell-based high throughput dose response assay for biased ligands (antagonists) of the melanocortin 4 receptor (MC4R)
IC50
>64575±n/a nM
Citation
 PubChem, PC TRFRET-based cell-based high throughput dose response assay for biased ligands (antagonists) of the melanocortin 4 receptor (MC4R) PubChem Bioassay (2012)[AID] 
Target
Name:
Melanocortin receptor 4
Synonyms:
MC4-R MC4R_HUMAN Melanocortin receptor 4 (MC-4) Melanocortin receptor 4 (MC4R)
Type:
Enzyme
Mol. Mass.:
36949.50
Organism:
Homo sapiens (Human)
Description:
P32245
Residue:
332
  
Inhibitor
Name:
BDBM68180
Synonyms:
MLS000876826 cid_16745397
Type:
Small organic molecule
Emp. Form.:
C28H38O6
Mol. Mass.:
470.5977
SMILES:
[H][C@@]12CC3C(CC[C@]4(C)C(CC[C@@]34[H])[C@H](C)C3CC(C)=C(CO)C(=O)O3)[C@@]3(C)C(=O)C=C[C@H](O)[C@@]13O2
: