Target
V-type proton ATPase subunit c'
Ligand
BDBM87566
Substrate
Meas. Tech.
Dose Response with BCECF Assay for V-ATPase inhibitors that increase vacuolar pH, Powder Set 1
EC50
390±n/a nM
Citation
 PubChem, PC Dose Response with BCECF Assay for V-ATPase inhibitors that increase vacuolar pH, Powder Set 1 PubChem Bioassay (2012)[AID] 
Target
Name:
V-type proton ATPase subunit c'
Synonyms:
CLS9 VATL2_YEAST Vma11p
Type:
Enzyme Catalytic Domain
Mol. Mass.:
17039.28
Organism:
Saccharomyces cerevisiae S288c
Description:
gi_6325022
Residue:
164
  
Inhibitor
Name:
BDBM87566
Synonyms:
MLS001234228 [4-(4,6-difluoro-1,3-benzothiazol-2-yl)-1-piperazinyl]-(5-nitro-2-furanyl)methanone [4-(4,6-difluoro-1,3-benzothiazol-2-yl)piperazino]-(5-nitro-2-furyl)methanone cid_7539642
Type:
Small organic molecule
Emp. Form.:
C16H12F2N4O4S
Mol. Mass.:
394.353
SMILES:
[O-][N+](=O)c1ccc(o1)C(=O)N1CCN(CC1)c1nc2c(F)cc(F)cc2s1
: