Target
Lethal factor
Ligand
BDBM50064899
Substrate
Meas. Tech.
High-throughput multiplex microsphere dose response for inhibitors of toxin protease, specifically Lethal Factor protease, compounds from Cherry Pick 02
EC50
>20000±n/a nM
Citation
 PubChem, PC High-throughput multiplex microsphere dose response for inhibitors of toxin protease, specifically Lethal Factor protease, compounds from Cherry Pick 02 PubChem Bioassay (2012)[AID] 
Target
Name:
Lethal factor
Synonyms:
Anthrax Lethal Factor (LF) Antrax lethal toxin lef | lethal factor
Type:
PROTEIN
Mol. Mass.:
93758.56
Organism:
Bacillus anthracis
Description:
ChEMBL_1460338
Residue:
809
  
Inhibitor
Name:
BDBM50064899
Synonyms:
2-(3,4-Dimethoxy-phenyl)-5-hydroxy-3,6,7,8-tetramethoxy-chromen-4-one CHEMBL422237 | cid_136417
Type:
Small organic molecule
Emp. Form.:
C21H22O9
Mol. Mass.:
418.394
SMILES:
COc1ccc(cc1OC)-c1oc2c(OC)c(OC)c(OC)c(O)c2c(=O)c1OC
: