Target
Lethal factor
Ligand
BDBM3645
Substrate
Meas. Tech.
High-throughput multiplex microsphere dose response for inhibitors of toxin protease, specifically Lethal Factor protease, compounds from Cherry Pick 02
EC50
>20000±n/a nM
Citation
 PubChem, PC High-throughput multiplex microsphere dose response for inhibitors of toxin protease, specifically Lethal Factor protease, compounds from Cherry Pick 02 PubChem Bioassay (2012)[AID] 
Target
Name:
Lethal factor
Synonyms:
Anthrax Lethal Factor (LF) Antrax lethal toxin lef | lethal factor
Type:
PROTEIN
Mol. Mass.:
93758.56
Organism:
Bacillus anthracis
Description:
ChEMBL_1460338
Residue:
809
  
Inhibitor
Name:
BDBM3645
Synonyms:
cid_3095057
Type:
Emp. Form.:
C11H7N5O7
Mol. Mass.:
321.2026
SMILES:
[O-][N+](=O)c1cc(cc(c1)[N+]([O-])=O)C(=O)Nc1c[nH]c(=O)[nH]c1=O
: