Target
Lethal factor
Ligand
BDBM74437
Substrate
Meas. Tech.
High-throughput multiplex microsphere dose response for inhibitors of toxin protease, specifically Lethal Factor protease, compounds from Cherry Pick 02
EC50
11500±n/a nM
Citation
 PubChem, PC High-throughput multiplex microsphere dose response for inhibitors of toxin protease, specifically Lethal Factor protease, compounds from Cherry Pick 02 PubChem Bioassay (2012)[AID] 
Target
Name:
Lethal factor
Synonyms:
Anthrax Lethal Factor (LF) Antrax lethal toxin lef | lethal factor
Type:
PROTEIN
Mol. Mass.:
93758.56
Organism:
Bacillus anthracis
Description:
ChEMBL_1460338
Residue:
809
  
Inhibitor
Name:
BDBM74437
Synonyms:
5-bromo-3-pyridinecarboxylic acid [2-(1-adamantylamino)-2-oxoethyl] ester MLS002248081 [2-(1-adamantylamino)-2-oxidanylidene-ethyl] 5-bromanylpyridine-3-carboxylate cid_4472168
Type:
Small organic molecule
Emp. Form.:
C18H21BrN2O3
Mol. Mass.:
393.275
SMILES:
[H]C12CC3([H])CC([H])(C1)CC(C2)(C3)NC(=O)COC(=O)c1cncc(Br)c1
: