Target
Lethal factor
Ligand
BDBM80824
Substrate
Meas. Tech.
High-throughput multiplex microsphere dose response for inhibitors of toxin protease, specifically Lethal Factor protease, compounds from Cherry Pick 02
EC50
>20000±n/a nM
Citation
 PubChem, PC High-throughput multiplex microsphere dose response for inhibitors of toxin protease, specifically Lethal Factor protease, compounds from Cherry Pick 02 PubChem Bioassay (2012)[AID] 
Target
Name:
Lethal factor
Synonyms:
Anthrax Lethal Factor (LF) Antrax lethal toxin lef | lethal factor
Type:
PROTEIN
Mol. Mass.:
93758.56
Organism:
Bacillus anthracis
Description:
ChEMBL_1460338
Residue:
809
  
Inhibitor
Name:
BDBM80824
Synonyms:
1,3-benzoxazol-2-yl-[1-(3-isoquinolyl)ethylideneamino]amine N-(1-isoquinolin-3-ylethylideneamino)-1,3-benzoxazol-2-amine SMR001565990 | cid_392789
Type:
Small organic molecule
Emp. Form.:
C18H14N4O
Mol. Mass.:
302.33
SMILES:
CC(N=Nc1nc2ccccc2o1)c1cc2ccccc2cn1
: