Target
Botulinum neurotoxin type A
Ligand
BDBM87745
Substrate
Meas. Tech.
High-throughput multiplex microsphere dose response for inhibitors of toxin protease, specifically Botulinum neurotoxin light chain A protease, compounds from Cherry Pick 02
EC50
>20000±n/a nM
Citation
 PubChem, PC High-throughput multiplex microsphere dose response for inhibitors of toxin protease, specifically Botulinum neurotoxin light chain A protease, compounds from Cherry Pick 02 PubChem Bioassay (2012)[AID] 
Target
Name:
Botulinum neurotoxin type A
Synonyms:
BXA1_CLOBH bna | botA
Type:
PROTEIN
Mol. Mass.:
149421.96
Organism:
Clostridium botulinum (strain Hall / ATCC 3502 / NCTC 13319 / Type A)
Description:
ChEMBL_987932
Residue:
1296
  
Inhibitor
Name:
BDBM87745
Synonyms:
MLS000529701 N-[(1,2-dimethylindol-5-yl)methyl]-4-(dimethylsulfamoyl)benzamide cid_5167419
Type:
Small organic molecule
Emp. Form.:
C20H23N3O3S
Mol. Mass.:
385.48
SMILES:
CN(C)S(=O)(=O)c1ccc(cc1)C(=O)NCc1ccc2n(C)c(C)cc2c1
: